{"text_format":"1","workbook":"xlsx","n_sheets":9,"sheets":["START","VYPOCTY","VYPOCTY18","VYPOCTY20","VÝSTUP","hraze 0","hraze 12","hraze 20","List1"],"not_rendered":{"charts":0,"images":0,"macros":1,"external_links":0,"defined_names":5,"comments":0,"pivot_tables":0},"unopened":[],"bounds":{"document_bytes":16777216,"sheet_cells":100000,"rows_first":2000,"rows_last":500,"rows_between":2000,"halvings":0,"cell_chars":16384,"cell_head_chars":4096},"cells_cut":0,"cells_raw":0,"read":"whole","date_system":"1900"}

{"sheet":"START","index":0,"n_rows":34,"n_cols":19,"rows_kept":34,"cut":false,"hidden":false,"merged":[]}
[]
[null,"Údržba hráze ",null,null,null,null,null,null,null,null,null,null,null,null,null,"Postup výpočtu"]
[]
[]
[]
[]
[]
[]
[]
[null,null,null,null,null,"sklon do 12°",null,"sklon do 20°",null,"sklon nad 20°",null,null,null,null,null,"1. Zadání rozsahu zpracované plochy podle sklonu a typu porostu"]
[null,null,null,null,null,null,null,null,null,null,null,null,"celková plocha",null,null,"     Ploch se zadává v m2"]
[null,"Zpracovaná plocha",null,null,null,"plocha v metrech",null,"plocha v metrech",null,"plocha v metrech",null,null,null,null,null,"2. Zadání přepravní vzdálenosti a rozsahu práce energetických prostředků a nakladačů"]
[null,null,"bylinný porost",null,null,null,null,null,null,null,null,null,{"$f":"F13+H13+J13","v":0},null,null,"3. Volba technologie pro jednotlivé sklony"]
[null,null,"bylinný porost a keře",null,null,null,null,null,null,null,null,null,{"$f":"F14+H14+J14","v":0},null,null,"4. na výstupním listě volba technologie dopravy a práce EP a nakládání"]
[null,null,"bylinný porost  a stromy",null,null,null,null,null,null,null,null,null,0,null,null,"5 Tisk výsledků"]
[null,null,"bylinný porost stromy a keře",null,null,null,null,null,null,null,null,null,0]
[null,null,"počet stromů ke kácení",null,null,null,null,null,null,null,null,null,0]
[null,null,"průměr pařezů"]
[null,null,"počet likvydovaných pařezů",null,null,null,null,null,null,null,null,null,0]
[null,null,null,null,null,null,null,null,null,null,null,null,null,null,null,"Realizační výstup výzkumného projektu č. QJ1220029 pod názvemvýzkum"]
{"$rows_left_out":15}
{"sheet":"VYPOCTY","index":1,"n_rows":42,"n_cols":9,"rows_kept":42,"cut":false,"hidden":false,"merged":[]}
[]
[null,null,"Údržba hráze se sklonem do 12°"]
[null,null,"Zpracovaná plocha",null,null,null,"plocha v metrech"]
[null,null,null,"bylinný porost",null,null,{"$f":"START!F13","v":0}]
[null,null,null,"bylinný porost a keře",null,null,{"$f":"START!F14","v":0}]
[null,null,null,"bylinný porost  a stromy",null,null,{"$f":"START!F15","v":0}]
[null,null,null,"bylinný porost stromy a keře",null,null,{"$f":"START!F16","v":0}]
[null,null,null,"počet stromů ke kácení",null,null,{"$f":"START!F17","v":0}]
[null,null,null,"průměr pařezů",null,null,{"$f":"START!F18","v":0}]
[null,null,null,"počet likvydovaných pařezů",null,null,{"$f":"START!F19","v":0}]
[null,null,null,null,null,"náklad na m plochy"]
[null,null,null,null,null,null,"náklad na zpracovanou plochu"]
[null,null,"Sečení - jenom bylinný porost"]
[null,null,null,1,null,{"$f":"INDEX('hraze 0'!D2:D8,I14,1)","v":0},{"$f":"G4*F14","v":0},null,1]
[null,null,"Sečení - bylinný porost a keře",null,null,null,null,null,1]
[null,null,null,null,null,{"$f":"INDEX('hraze 0'!H2:H6,I16,1)","v":0},{"$f":"G5*F16","v":0},null,1]
[null,null,"Sečení - bylinný porost  a stromy",null,null,null,null,null,1]
[null,null,null,null,null,{"$f":"INDEX('hraze 0'!L2:L7,I18,1)","v":0},{"$f":"G6*F18","v":0},null,1]
[null,null,"Sečení - bylinný porost stromy a keře",null,null,null,null,null,1]
[null,null,null,null,null,{"$f":"INDEX('hraze 0'!P2:P7,I21,1)","v":0},{"$f":"G7*F20","v":0},null,1]
{"$rows_left_out":23}
{"sheet":"VYPOCTY18","index":2,"n_rows":42,"n_cols":9,"rows_kept":42,"cut":false,"hidden":false,"merged":[]}
[]
[null,null,"Údržba hráze se sklonem nad 12°"]
[null,null,"Zpracovaná plocha",null,null,null,"plocha v metrech"]
[null,null,null,"bylinný porost",null,null,{"$f":"START!H13","v":0}]
[null,null,null,"bylinný porost a keře",null,null,{"$f":"START!H14","v":0}]
[null,null,null,"bylinný porost  a stromy",null,null,{"$f":"START!H15","v":0}]
[null,null,null,"bylinný porost stromy a keře",null,null,{"$f":"START!H16","v":0}]
[null,null,null,"počet stromů ke kácení",null,null,{"$f":"START!H17","v":0}]
[null,null,null,"průměr pařezů",null,null,{"$f":"START!H18","v":0}]
[null,null,null,"počet likvidovaných pařezů",null,null,{"$f":"START!H19","v":0}]
[null,null,null,null,null,"náklad na m plochy"]
[null,null,null,null,null,null,"náklad na zpracovanou plochu"]
[null,null,"Sečení - jenom bylinný porost"]
[null,null,null,1,null,{"$f":"INDEX('hraze 12'!D2:D6,I14,1)","v":0},{"$f":"G4*F14","v":0},null,1]
[null,null,"Sečení - bylinný porost a keře",null,null,null,null,null,1]
[null,null,null,null,null,{"$f":"INDEX('hraze 12'!H2:H6,I16,1)","v":0},{"$f":"G5*F16","v":0},null,1]
[null,null,"Sečení - bylinný porost  a stromy",null,null,null,null,null,1]
[null,null,null,null,null,{"$f":"INDEX('hraze 12'!L2:L7,I18,1)","v":0},{"$f":"G6*F18","v":0},null,1]
[null,null,"Sečení - bylinný porost stromy a keře",null,null,null,null,null,1]
[null,null,null,null,null,{"$f":"INDEX('hraze 12'!P2:P7,I21,1)","v":0},{"$f":"G7*F20","v":0},null,1]
{"$rows_left_out":23}
{"sheet":"VYPOCTY20","index":3,"n_rows":42,"n_cols":9,"rows_kept":42,"cut":false,"hidden":false,"merged":[]}
[]
[null,null,"Údržba hráze se sklonem nad 20°"]
[null,null,"Zpracovaná plocha",null,null,null,"plocha v metrech"]
[null,null,null,"bylinný porost",null,null,{"$f":"START!J13","v":0}]
[null,null,null,"bylinný porost a keře",null,null,{"$f":"START!J14","v":0}]
[null,null,null,"bylinný porost  a stromy",null,null,{"$f":"START!J15","v":0}]
[null,null,null,"bylinný porost stromy a keře",null,null,{"$f":"START!J16","v":0}]
[null,null,null,"počet stromů ke kácení",null,null,{"$f":"START!J17","v":0}]
[null,null,null,"průměr pařezů",null,null,{"$f":"START!J18","v":0}]
[null,null,null,"počet likvydovaných pařezů",null,null,{"$f":"START!J19","v":0}]
[null,null,null,null,null,"náklad na m plochy","náklad na zpracovanou plochu"]
[]
[null,null,"Sečení - jenom bylinný porost"]
[null,null,null,null,null,{"$f":"INDEX('hraze 20'!D2:D5,I14,1)","v":0},{"$f":"G4*F14","v":0},null,1]
[null,null,"Sečení - bylinný porost a keře",null,null,null,null,null,1]
[null,null,null,null,null,{"$f":"INDEX('hraze 20'!H2:H5,I16,1)","v":0},{"$f":"G5*F16","v":0},null,1]
[null,null,"Sečení - bylinný porost  a stromy",null,null,null,null,null,1]
[null,null,null,null,null,{"$f":"INDEX('hraze 20'!L2:L5,I18,1)","v":0},{"$f":"G6*F18","v":0},null,1]
[null,null,"Sečení - bylinný porost stromy a keře",null,null,null,null,null,1]
[null,null,null,null,null,{"$f":"INDEX('hraze 20'!P2:P5,I20,1)","v":0},{"$f":"G7*F20","v":0},null,1]
{"$rows_left_out":23}
{"sheet":"VÝSTUP","index":4,"n_rows":41,"n_cols":16,"rows_kept":41,"cut":false,"hidden":false,"merged":[]}
[]
["VÝSLEDKY"]
[null,null,"Údržba hráze se sklonem do 12°",null,null,null,null,null,null,{"$f":"VYPOCTY!G42","v":0}]
[]
[null,null,"Údržba hráze se sklonem do 20°",null,null,null,null,null,null,{"$f":"VYPOCTY18!G42","v":0}]
[]
[null,null,"Údržba hráze se sklonem nad 20°",null,null,null,null,null,null,{"$f":"VYPOCTY20!G42","v":0}]
[]
[]
[]
[]
[null,null,"Doplňkové náklady "]
[]
[null,null,"Doprava technologická (podle km)",null,null,null,null,null,null,null,null,1]
[null,null,null,null,null,null,null,null,null,null,null,1]
[null,null,null,null,null,null,null,null,null,{"$f":"INDEX(List1!P21:P26,L16,1)*START!H22","v":0},null,1]
[null,null,null,null,null,null,null,null,null,null,null,1]
[null,null,"Náklady na práci energetických prostředků (h)",null,null,null,null,null,null,null,null,1]
[null,null,null,null,null,null,null,null,null,null,null,1]
[null,null,null,null,null,null,null,null,null,{"$f":"INDEX(List1!P5:P17,L20,1)*START!H23","v":0},null,1]
{"$rows_left_out":22}
{"sheet":"hraze 0","index":5,"n_rows":31,"n_cols":16,"rows_kept":31,"cut":false,"hidden":true,"merged":[]}
[null,"operace 0","technika 0","jen bylinný porost 0",null,"operace 0","technika 0","bylinný porost a keře 0",null,"operace 0","technika 0","bylinný porost  a stromy 0",null,"operace 0","technika 0","bylinný porost stromy a keře 0"]
[]
[null,"sečení porostu","traktor + žací stroj rotační",0.05,null,"sečení porostu","ručně vedený žací stroj - bez sběru",1.5,null,"sečení porostu","ručně vedený žací stroj - bez sběru",1.5,null,"sečení porostu","ručně vedený žací stroj - bez sběru",1.5]
[null,"sečení porostu","ručně vedený žací stroj - bez sběru",1.5,null,"sečení porostu","křovinořez",1.8,null,"sečení porostu","křovinořez",1.8,null,"sečení porostu","křovinořez",1.8]
[null,"sečení porostu","křovinořez",1.8,null,"sečení porostu + sběr","ručně vedený žací stroj - s košem",1.8,null,"sečení porostu + sběr","ručně vedený žací stroj - s košem",1.8,null,"sečení porostu + sběr","ručně vedený žací stroj - s košem",1.8]
[null,"sečení porostu + sběr","ručně vedený žací stroj - s košem",1.8,null,"sečení porostu","traktor+mulčovač nesený",7.0000000000000007E-2,null,"sečení porostu","traktor+mulčovač nesený",7.0000000000000007E-2,null,"sečení porostu","traktor+mulčovač nesený",7.0000000000000007E-2]
[null,"sečení porostu","traktor+mulčovač nesený",7.0000000000000007E-2,null,"sečení porostu","traktor+mulčovač nesený se sběrem",0.09,null,"sečení porostu","traktor+mulčovač nesený se sběrem",0.09,null,"sečení porostu","traktor+mulčovač nesený se sběrem",0.09]
[null,"sečení porostu","traktor+mulčovač nesený se sběrem",0.09]
[]
[null,"shrnování trávy","dopravníkový shrnovač",0.04,null,"shrnování trávy","dopravníkový shrnovač",0.04,null,"shrnování trávy na hromady do 50 m","ruční nářadí",2,null,"shrnování trávy na hromady do 50 m","ruční nářadí",2]
[null,"shrnování trávy na hromady do 50 m","ruční nářadí",2,null,"shrnování trávy na hromady do 50 m","ruční nářadí",2,null,"shrnování trávy","dopravníkový shrnovač",0.04,null,"shrnování trávy","dopravníkový shrnovač",0.04]
[]
[null,"sběr trávy","traktor  +  sběrací vůz",7.0000000000000007E-2,null,"sběr trávy","traktor  +  sběrací vůz",7.0000000000000007E-2,null,"shrnování trávy nakládání ručně","ruční nářadí",2.4,null,"shrnování trávy nakládání ručně","ruční nářadí",2.5]
[null,"shrnování trávy nakládání ručně","ruční nářadí",2.2000000000000002,null,"shrnování trávy nakládání ručně","ruční nářadí",2.4,null,"sběr trávy","traktor  +  sběrací vůz",7.0000000000000007E-2,null,"sběr trávy","traktor  +  sběrací vůz",7.0000000000000007E-2]
[]
[null,"chemická likvidace porostu + přípravek","ruční postřik",2.5,null,"chemická likvidace porostu + přípravek","ruční postřik",2.5,null,"chemická likvidace porostu + přípravek","ruční postřik",2.5,null,"chemická likvidace porostu + přípravek","ruční postřik",2.5]
[]
[null,null,null,null,null,"likvidace křovin 10% plochy","křovinořez",1.5,null,"likvidace křovin 10% plochy","křovinořez","není",null,"likvidace křovin 10% plochy","křovinořez",1.5]
[null,null,null,null,null,"likvidace křovin 50% plochy","křovinořez",7.5,null,"likvidace křovin 50% plochy","křovinořez","není",null,"likvidace křovin 50% plochy","křovinořez",7.5]
[]
{"$rows_left_out":12}
{"sheet":"hraze 12","index":6,"n_rows":25,"n_cols":16,"rows_kept":25,"cut":false,"hidden":true,"merged":[]}
[null,"operace 12","technika 0","jen bylinný porost 12",null,"operace 12","technika 0","bylinný porost a keře 12",null,"operace 12","technika 0","bylinný porost  a stromy 12",null,"operace 12","technika 0","bylinný porost stromy a keře12"]
[]
[null,"sečení porostu","křovinořez",2.1,null,"sečení porostu","křovinořez",2.1,null,"sečení porostu","křovinořez",2.1,null,"sečení porostu","křovinořez",2.1]
[null,"sečení porostu sběr","ručně vedený žací stroj - s košem",2.2999999999999998,null,"sečení porostu sběr","ručně vedený žací stroj - s košem",2.2999999999999998,null,"sečení porostu sběr","ručně vedený žací stroj - s košem",2.2999999999999998,null,"sečení porostu sběr","ručně vedený žací stroj - s košem",2.2999999999999998]
[null,"sečení porostu","traktor+mulčovač nesený",0.08,null,"sečení porostu","traktor+mulčovač nesený",0.09,null,"sečení porostu","traktor+mulčovač nesený",0.09,null,"sečení porostu","traktor+mulčovač nesený",0.1]
[null,"sečení porostu","traktor+ mulčovač nesený se sběrem",0.1,null,"sečení porostu","traktor+ mulčovač nesený se sběrem",0.11,null,"sečení porostu","traktor+ mulčovač nesený se sběrem",0.11,null,"sečení porostu","traktor+ mulčovač nesený se sběrem",0.13]
[]
[null,"shrnování trávy nakládání ručně","ruční nářadí",2.2000000000000002,null,"shrnování trávy nakládání ručně","ruční nářadí",2.4,null,"shrnování trávy nakládání ručně","ruční nářadí",2.4,null,"shrnování trávy nakládání ručně","ruční nářadí",2.5]
[]
[null,"chemická likvidace porostu + přípravek","ruční postřik",3.5,null,"chemická likvidace porostu + přípravek","ruční postřik",3.5,null,"chemická likvidace porostu + přípravek","ruční postřik",3.5,null,"chemická likvidace porostu + přípravek","ruční postřik",3.5]
[]
[null,null,null,null,null,"likvidace křovin 10% plochy","křovinořez",1.5,null,"shrnování trávy nakládání ručně","ruční nářadí + traktor přívěs",2.5,null,"likvidace křovin 10% plochy","křovinořez",1.5]
[null,null,null,null,null,"likvidace křovin 50% plochy","křovinořez",7.5,null,"shrnování trávy nakládání sběračem","shrnování ručně traktor  +  sběrací vůz",1.89,null,"likvidace křovin 50% plochy","křovinořez",7.5]
[]
[null,null,null,null,null,null,null,null,null,"Kácení stromů o průměru do 20 cm (1 ks)","pila",100,null,"Kácení stromů o průměru do 20 cm (1 ks)","pila",300]
[null,null,null,null,null,null,null,null,null,"Kácení stromů o průměru   21-50 cm (1 ks)","pila",220,null,"Kácení stromů o průměru   21-50 cm (1 ks)","pila",550]
[null,null,null,null,null,null,null,null,null,"Kácení stromů o průměru   51-80 cm (1 ks)","pila",1050,null,"Kácení stromů o průměru   51-80 cm (1 ks)","pila",4200]
[null,null,null,null,null,null,null,null,null,"Kácení stromů o průměru   81-150 cm (1 ks)","pila",1260,null,"Kácení stromů o průměru   81-150 cm (1 ks)","pila",7350]
[null,null,null,null,null,null,null,null,null,"Kácení stromů o průměru nad 150 cm (1 ks)","pila",1800,null,"Kácení stromů o průměru nad 150 cm (1 ks)","pila",21000]
[]
{"$rows_left_out":6}
{"sheet":"hraze 20","index":7,"n_rows":21,"n_cols":16,"rows_kept":21,"cut":false,"hidden":true,"merged":[]}
[null,"operace 20","technika 0","jen bylinný porost 20",null,"operace 20","technika 0","bylinný porost a keře 20",null,"operace 20","technika 0","bylinný porost  a stromy 20",null,"operace 20","technika 0","bylinný porost stromy a keře 20"]
[]
[null,"sečení porostu","ručně vedený žací stroj - bez  sběru dálk. řízený",6,null,"sečení porostu","ručně vedený žací stroj - bez  sběru dálk. řízený",8,null,"sečení porostu","ručně vedený žací stroj - bez  sběru dálk. řízený",7,null,"sečení porostu","ručně vedený žací stroj - bez  sběru dálk. řízený",8]
[null,"sečení porostu","křovinořez",2.1,null,"sečení porostu","křovinořez",2.1,null,"sečení porostu","křovinořez",2.1,null,"sečení porostu","křovinořez",2.1]
[null,"sečení porostu","ručně vedený žací stroj - s košem",2.2999999999999998,null,"sečení porostu","ručně vedený žací stroj - s košem",2.4,null,"sečení porostu","ručně vedený žací stroj - s košem",2.4,null,"sečení porostu","ručně vedený žací stroj - s košem",2.5]
[]
[null,"shrnování  trávy + nakládání ručně","ruční nářadí",2.2000000000000002,null,"shrnování  trávy + nakládání ručně","ruční nářadí",2.4,null,"shrnování  trávy + nakládání ručně","ruční nářadí",2.4,null,"shrnování  trávy + nakládání ručně","ruční nářadí",2.5]
[]
[null,"chemická likvidace porostu + přípravek","ruční postřik",3.5,null,"chemická likvidace porostu + přípravek","ruční postřik",3.5,null,"chemická likvidace porostu + přípravek","ruční postřik",3.5,null,"chemická likvidace porostu + přípravek","ruční postřik",3.5]
[]
[null,null,null,null,null,"likvidace   křovin 10% plochy","křovinořez",1.5,null," nakládání ručně","ruční nářadí + traktor přívěs",2.5,null,"likvidace   křovin 10% plochy","křovinořez",1.5]
[null,null,null,null,null,"likvidace   křovin 50% plochy","křovinořez",7.5,null," nakládání sběračem","shrnování ručně traktor  +  sběrací vůz",1.89,null,"likvidace   křovin 50% plochy","křovinořez",7.5]
[]
[null,null,null,null,null,null,null,null,null,"Kácení stromů o průměru do 20 cm (1 ks)","pila",190,null,"Kácení stromů o průměru do 20 cm (1 ks)","pila",190]
[null,null,null,null,null,null,null,null,null,"Kácení stromů o průměru   21-50 cm (1 ks)","pila",1000,null,"Kácení stromů o průměru   21-50 cm (1 ks)","pila",1000]
[null,null,null,null,null,null,null,null,null,"Kácení stromů o průměru   51-80 cm (1 ks)","pila",1050,null,"Kácení stromů o průměru   51-80 cm (1 ks)","pila",4200]
[null,null,null,null,null,null,null,null,null,"Kácení stromů o průměru   81-150 cm (1 ks)","pila",1260,null,"Kácení stromů o průměru   81-150 cm (1 ks)","pila",7350]
[null,null,null,null,null,null,null,null,null,"Kácení stromů o průměru nad 150 cm (1 ks)","pila",18000,null,"Kácení stromů o průměru nad 150 cm (1 ks)","pila",21000]
[]
[]
{"$rows_left_out":2}
{"sheet":"List1","index":8,"n_rows":35,"n_cols":16,"rows_kept":35,"cut":false,"hidden":true,"merged":[[3,4,4,4],[3,5,4,5],[3,6,4,6]]}
[]
[]
[]
[null,null,null,null,"Popis","MJ","min náklad","max.",null,null,null,"jedn.","[l.měr.jedn.-1]","[h.měr.jedn.-1]","[Kč.měr.jedn.-1]","[Kč.měr.jedn.-1]"]
[null,null,null,null,null,null,null,"náklad"]
[null,null,null,null,null,null,"Kč","Kč",null,null,"Práce jednonápravového malotraktoru","h",0.5,1,156,170]
[null,null,null,null,"Kosení ve vegetačním období travního porostu řídkého   ","m2",0.42,0.60899999999999999,null,null,"Práce dvounápravových malotraktorů do 15 kW","h",2.4,1,162,230]
[null,null,null,null,"Kosení ve vegetačním období travního porostu středně hustého   ","m2",0.62,0.89800000000000002,null,null,"Práce dvounápravových malotraktorů nad 15 kW","h",3.5,1,240,340]
[null,null,null,null,"Kosení ve vegetačním období travního porostu hustého   ","m2",0.87,1.26,null,null,"Práce traktorů o výkonu motoru 30 - 39 kW","h",5.5,1,350,500]
[null,null,null,null,"Kosení ve vegetačním období divokého porostu řídkého   ","m2",0.61,0.877,null,null,"Práce traktorů o výkonu motoru 40-49 kW","h",7,1,400,600]
[null,null,null,null,"Kosení ve vegetačním období divokého porostu středně hustého   ","m2",0.83,1.21,null,null,"Práce traktorů o výkonu motoru 50-59 kW","h",8.5,1,450,700]
[null,null,null,null,"Kosení ve vegetačním období divokého porostu hustého   ","m2",1.19,1.73,null,null,"Práce traktorů o výkonu motoru 60-69 kW","h",10,1,500,800]
[null,null,null,null,"Kosení ve vegetačním období vodního rostlinstva na břehu řídkého   ","m2",1.1100000000000001,1.61,null,null,"Práce traktorů o výkonu motoru 70-79 kW","h",11.5,1,550,900]
[null,null,null,null,"Kosení ve vegetačním období vodního rostlinstva na břehu středně hustého   ","m2",1.66,2.4,null,null,"Práce traktorů o výkonu motoru 80-99 kW","h",14,1,600,1000]
[null,null,null,null,"Kosení ve vegetačním období vodního rostlinstva na břehu hustého   ","m2",2.33,3.38,null,null,"Práce traktorů o výkonu motoru 100-119 kW","h",16,1,700,1150]
[null,null,null,null,"Kosení ve vegetačním období vodního rostlinstva pod vodou řídkého hl do 300 mm   ","m2",1.31,1.9,null,null,"Práce traktorů o výkonu motoru 120 - 180 kW","h",21,1,750,1340]
[null,null,null,null,"Kosení ve vegetačním období vodního rostlinstva pod vodou řídkého hl přes 300 mm   ","m2",0.62,0.89500000000000002,null,null,"Práce traktorů o výkonu motoru nad 180 kW","h",27,1,1050,1810]
[null,null,null,null,"Kosení ve vegetačním období vodního rostlinstva pod vodou středně hustého hl do 300 mm   ","m2",2.04,2.96]
[null,null,null,null,"Kosení ve vegetačním období vodního rostlinstva pod vodou středně hustého hl přes 300 mm   ","m2",0.73,1.06]
[null,null,null,null,"Kosení ve vegetačním období vodního rostlinstva pod vodou hustého hl do 300 mm   ","m2",3,4.3499999999999996]
{"$rows_left_out":15}